Вопрос по ruby – Не удается установить Ruby 1.9.3 на чистой Lion Install

1

Error: User Rate Limit Exceeded

Error: User Rate Limit Exceededmake.log

compiling readline.c
readline.c:1499:9: error: use of undeclared identifier 'username_completion_function'; did you mean 'rl_username_completion_function'?
                                    rl_username_completion_function);
                                    ^
readline.c:69:42: note: expanded from macro 'rl_username_completion_function'
# define rl_username_completion_function username_completion_function
                                         ^
/usr/local/include/readline/readline.h:443:14: note: 'rl_username_completion_function' declared here
extern char *rl_username_completion_function PARAMS((const char *, int));
             ^
1 error generated.
make[2]: *** [readline.o] Error 1
make[1]: *** [ext/readline/all] Error 2
make: *** [build-ext] Error 2

Error: User Rate Limit Exceeded

Error: User Rate Limit Exceededexport ARCHFLAGS="-arch x86_64"Error: User Rate Limit Exceeded.bash_loginError: User Rate Limit Exceeded

Error: User Rate Limit Exceededrvm install 1.9.3 --with-gcc=clangError: User Rate Limit Exceeded

Error: User Rate Limit Exceeded

Error: User Rate Limit Exceeded

Error: User Rate Limit Exceeded

Error: User Rate Limit Exceeded Andrew Lauer Barinov
Error: User Rate Limit Exceeded Mark Reed
Error: User Rate Limit Exceeded Andrew Marshall
Error: User Rate Limit Exceeded Mark Reed
Error: User Rate Limit Exceeded1.9.3-p125Error: User Rate Limit Exceeded Andrew Marshall

Ваш Ответ

1   ответ
1

rvm install 1.9.3 --with-gcc=clang --with-readline-dir=$rvm_path/usr
Error: User Rate Limit Exceeded Andrew Lauer Barinov
Error: User Rate Limit Exceeded
Error: User Rate Limit Exceeded
Error: User Rate Limit Exceeded
Error: User Rate Limit Exceeded Andrew Lauer Barinov

Похожие вопросы